{"text_format":"1","workbook":"xlsx","n_sheets":8,"sheets":["BasicCalcs","Canoe","Drawing","Unfold Offset Table","Unfold Plot","Offset Table","Section","Slice"],"not_rendered":{"charts":1,"images":0,"macros":1,"external_links":3,"defined_names":3,"comments":0,"pivot_tables":0},"unopened":[],"bounds":{"document_bytes":16777216,"sheet_cells":100000,"rows_first":2000,"rows_last":500,"rows_between":2000,"halvings":0,"cell_chars":16384,"cell_head_chars":4096},"cells_cut":0,"cells_raw":0,"read":"whole","date_system":"1900"}

{"sheet":"BasicCalcs","index":0,"n_rows":94,"n_cols":5,"rows_kept":94,"cut":false,"hidden":false,"merged":[[66,2,66,3],[73,1,73,4],[85,1,85,4],[1,1,1,4],[13,1,13,4],[24,1,24,4],[37,1,37,4],[57,1,57,4],[59,1,59,4]]}
[]
[null,"Canoe Basic Metrics"]
[null,"Length Overall (LOA)",{"$f":"Canoe!M2","v":3.93},"m"]
[null,"Beam Overall (BOA)",{"$f":"Canoe!M3","v":0.65},"m"]
[null,"Length Water Line (LWL)",{"$f":"Canoe!M4","v":3.6},"m"]
[null,"Beam Water Line (BWL)",{"$f":"Canoe!M5","v":0.55000000000000004},"m","Actually the bottom width"]
[null,"Depth Water Line (DWL)",{"$f":"Canoe!M6","v":7.4999999999999997E-2},"m"]
[null,"Rocker",{"$f":"Canoe!M7","v":2.5000000000000001E-2},"m"]
[null,"Amidships Deadrise",{"$f":"Canoe!M8","v":0},"Degrees"]
[null,"Amidships Freeboard",{"$f":"Canoe!M9","v":0.25},"m"]
{"$rows_left_out":85}
{"sheet":"Canoe","index":1,"n_rows":71,"n_cols":37,"rows_kept":71,"cut":false,"hidden":false,"merged":[[9,14,9,16],[10,8,10,11],[10,14,10,16],[0,0,0,2],[18,22,18,26],[0,8,0,16],[1,8,1,11],[1,14,1,16],[2,8,2,11],[2,14,2,16],[3,8,3,11],[3,14,3,16],[4,8,4,11],[4,14,4,16],[28,1,28,4],[28,6,28,9],[28,11,28,14],[28,16,28,19],[28,21,28,24],[18,32,18,36],[1,4,3,6],[18,17,18,21],[18,12,18,16],[18,7,18,11],[18,2,18,6],[18,27,18,31],[5,8,5,11],[5,14,5,16],[6,8,6,11],[6,14,6,16],[7,8,7,11],[7,14,7,16],[8,8,8,11],[8,14,8,16],[9,8,9,11]]}
["Canoe",null,null,null,null,null,null,null,"Canoe Basic Metrics"]
["Find Offet Table at row",19,null,null,null,null,null,null,"Length Overall (LOA)",null,null,null,{"$f":"(W22-C22)/1000","v":3.93},"m"]
["Stations",5,null,null,null,null,null,null,"Beam Overall (BOA)",null,null,null,{"$f":"N23/500","v":0.65},"m"]
["Chines",5,null,null,null,null,null,null,"Length Water Line (LWL)",null,null,null,{"$f":"(R24-H24)/1000","v":3.6},"m"]
["Forward-Aft Slice",100,"mm",null,null,null,null,null,"Beam Water Line (BWL)",null,null,null,{"$f":"N24/500","v":0.55000000000000004},"m","Actually the bottom width"]
["First slice",100,"mm",null,null,null,null,null,"Depth Water Line (DWL)",null,null,null,{"$f":"-O25/1000","v":7.4999999999999997E-2},"m"]
["Last slice",3900,"mm",null,null,null,null,null,"Rocker",null,null,null,{"$f":"(J24-O25)/1000","v":2.5000000000000001E-2},"m"]
["Water Line Slice",25,"mm",null,null,null,null,null,"Amidships Deadrise",null,null,null,{"$f":"DEGREES(ATAN2(N24-N25,O24-O25))","v":0},"Degrees"]
["Draft",-75,"mm",null,null,null,null,null,"Amidships Freeboard",null,null,null,{"$f":"O21/1000","v":0.25},"m"]
["Displacement",71.819025268000331,"dm3",null,null,null,null,null,"Forward Freeboard",null,null,null,{"$f":"E22/1000","v":0.26},"m"]
{"$rows_left_out":62}
{"sheet":"Drawing","index":2,"n_rows":43,"n_cols":37,"rows_kept":43,"cut":false,"hidden":false,"merged":[]}
["  "]
[]
[]
[]
[]
[]
[]
[]
[]
[]
{"$rows_left_out":34}
{"sheet":"Unfold Offset Table","index":3,"n_rows":63,"n_cols":25,"rows_kept":63,"cut":false,"hidden":false,"merged":[[4,1,4,4],[4,6,4,9],[4,11,4,14],[4,16,4,19],[4,21,4,24]]}
[null,null,null,"Xofs",249,null,null,null,"Xofs",399,null,null,null,"Xofs",434,null,null,null,"Xofs",407,null,null,null,"Xofs",0]
["Offset",400,1000,"Yofs",0,null,null,null,"Yofs",608,null,null,null,"Yofs",0,null,null,null,"Yofs",-1,null,null,null,"Yofs",0]
["Number of Lines",{"$f":"COUNT(A7:A107)","v":57},null,"Mirror",1,null,null,null,"Mirror",1,null,null,null,"Mirror",-1,null,null,null,"Mirror",1,null,null,null,"Mirror",1]
["Number of Planks",{"$f":"Canoe!B4-1","v":4},null,"Rotation",0,null,null,null,"Rotation",0,null,null,null,"Rotation",0,null,null,null,"Rotation",0,null,null,null,"Rotation",0]
[null,{"$f":"Canoe!B29","v":"Sole"},null,null,null,null,{"$f":"Canoe!G29","v":"Side"},null,null,null,null,{"$f":"Canoe!L29","v":"Deck"},null,null,null,null,{"$f":"Canoe!Q29","v":"Coaming"},null,null,null,null,{"$f":"Canoe!V29","v":0}]
[null,"X Lower","Y Lower","X Upper","Y Upper",null,"X Lower","Y Lower","X Upper","Y Upper",null,"X Lower","Y Lower","X Upper","Y Upper",null,"X Lower","Y Lower","X Upper","Y Upper",null,"X Lower","Y Lower","X Upper","Y Upper"]
[1,{"$f":"IF(Canoe!B31<>\"\",Canoe!B31*COS(RADIANS(E$4))-Canoe!C31*SIN(RADIANS(E$4))+E$1,\"\")","v":""},{"$f":"IF(Canoe!C31<>\"\",(Canoe!B31*SIN(RADIANS(E$4))+Canoe!C31*COS(RADIANS(E$4))*E$3)+E$2,\"\")","v":""},{"$f":"IF(Canoe!D31<>\"\",Canoe!D31*COS(RADIANS(E$4))-Canoe!E31*SIN(RADIANS(E$4))+E$1,\"\")","v":""},{"$f":"IF(Canoe!E31<>\"\",(Canoe!D31*SIN(RADIANS(E$4))+Canoe!E31*COS(RADIANS(E$4))*E$3)+E$2,\"\")","v":""},null,{"$f":"IF(Canoe!G31<>\"\",Canoe!G31*COS(RADIANS(J$4))-Canoe!H31*SIN(RADIANS(J$4))+J$1,\"\")","v":399},{"$f":"IF(Canoe!H31<>\"\",(Canoe!G31*SIN(RADIANS(J$4))+Canoe!H31*COS(RADIANS(J$4))*J$3)+J$2,\"\")","v":608},{"$f":"IF(Canoe!I31<>\"\",Canoe!I31*COS(RADIANS(J$4))-Canoe!J31*SIN(RADIANS(J$4))+J$1,\"\")","v":399},{"$f":"IF(Canoe!J31<>\"\",(Canoe!I31*SIN(RADIANS(J$4))+Canoe!J31*COS(RADIANS(J$4))*J$3)+J$2,\"\")","v":608},null,{"$f":"IF(Canoe!L31<>\"\",Canoe!L31*COS(RADIANS(O$4))-Canoe!M31*SIN(RADIANS(O$4))+O$1,\"\")","v":434},{"$f":"IF(Canoe!M31<>\"\",(Canoe!L31*SIN(RADIANS(O$4))+Canoe!M31*COS(RADIANS(O$4))*O$3)+O$2,\"\")","v":0},{"$f":"IF(Canoe!N31<>\"\",Canoe!N31*COS(RADIANS(O$4))-Canoe!O31*SIN(RADIANS(O$4))+O$1,\"\")","v":434},{"$f":"IF(Canoe!O31<>\"\",(Canoe!N31*SIN(RADIANS(O$4))+Canoe!O31*COS(RADIANS(O$4))*O$3)+O$2,\"\")","v":0},null,{"$f":"IF(Canoe!Q31<>\"\",Canoe!Q31*COS(RADIANS(T$4))-Canoe!R31*SIN(RADIANS(T$4))+T$1,\"\")","v":""},{"$f":"IF(Canoe!R31<>\"\",(Canoe!Q31*SIN(RADIANS(T$4))+Canoe!R31*COS(RADIANS(T$4))*T$3)+T$2,\"\")","v":""},{"$f":"IF(Canoe!S31<>\"\",Canoe!S31*COS(RADIANS(T$4))-Canoe!T31*SIN(RADIANS(T$4))+T$1,\"\")","v":""},{"$f":"IF(Canoe!T31<>\"\",(Canoe!S31*SIN(RADIANS(T$4))+Canoe!T31*COS(RADIANS(T$4))*T$3)+T$2,\"\")","v":""},null,{"$f":"IF(Canoe!V31<>\"\",Canoe!V31*COS(RADIANS(Y$4))-Canoe!W31*SIN(RADIANS(Y$4))+Y$1,\"\")","v":""},{"$f":"IF(Canoe!W31<>\"\",(Canoe!V31*SIN(RADIANS(Y$4))+Canoe!W31*COS(RADIANS(Y$4))*Y$3)+Y$2,\"\")","v":""},{"$f":"IF(Canoe!X31<>\"\",Canoe!X31*COS(RADIANS(Y$4))-Canoe!Y31*SIN(RADIANS(Y$4))+Y$1,\"\")","v":""},{"$f":"IF(Canoe!Y31<>\"\",(Canoe!X31*SIN(RADIANS(Y$4))+Canoe!Y31*COS(RADIANS(Y$4))*Y$3)+Y$2,\"\")","v":""}]
[2,{"$f":"IF(Canoe!B32<>\"\",Canoe!B32*COS(RADIANS(E$4))-Canoe!C32*SIN(RADIANS(E$4))+E$1,\"\")","v":""},{"$f":"IF(Canoe!C32<>\"\",(Canoe!B32*SIN(RADIANS(E$4))+Canoe!C32*COS(RADIANS(E$4))*E$3)+E$2,\"\")","v":""},{"$f":"IF(Canoe!D32<>\"\",Canoe!D32*COS(RADIANS(E$4))-Canoe!E32*SIN(RADIANS(E$4))+E$1,\"\")","v":""},{"$f":"IF(Canoe!E32<>\"\",(Canoe!D32*SIN(RADIANS(E$4))+Canoe!E32*COS(RADIANS(E$4))*E$3)+E$2,\"\")","v":""},null,{"$f":"IF(Canoe!G32<>\"\",Canoe!G32*COS(RADIANS(J$4))-Canoe!H32*SIN(RADIANS(J$4))+J$1,\"\")","v":467.42020920299439},{"$f":"IF(Canoe!H32<>\"\",(Canoe!G32*SIN(RADIANS(J$4))+Canoe!H32*COS(RADIANS(J$4))*J$3)+J$2,\"\")","v":487.76163082205176},{"$f":"IF(Canoe!I32<>\"\",Canoe!I32*COS(RADIANS(J$4))-Canoe!J32*SIN(RADIANS(J$4))+J$1,\"\")","v":467.43430116286174},{"$f":"IF(Canoe!J32<>\"\",(Canoe!I32*SIN(RADIANS(J$4))+Canoe!J32*COS(RADIANS(J$4))*J$3)+J$2,\"\")","v":607.68756821514},null,{"$f":"IF(Canoe!L32<>\"\",Canoe!L32*COS(RADIANS(O$4))-Canoe!M32*SIN(RADIANS(O$4))+O$1,\"\")","v":499.11448766923996},{"$f":"IF(Canoe!M32<>\"\",(Canoe!L32*SIN(RADIANS(O$4))+Canoe!M32*COS(RADIANS(O$4))*O$3)+O$2,\"\")","v":21.058363774088619},{"$f":"IF(Canoe!N32<>\"\",Canoe!N32*COS(RADIANS(O$4))-Canoe!O32*SIN(RADIANS(O$4))+O$1,\"\")","v":499.11925625756948},{"$f":"IF(Canoe!O32<>\"\",(Canoe!N32*SIN(RADIANS(O$4))+Canoe!O32*COS(RADIANS(O$4))*O$3)+O$2,\"\")","v":3.5903631151279022E-2},null,{"$f":"IF(Canoe!Q32<>\"\",Canoe!Q32*COS(RADIANS(T$4))-Canoe!R32*SIN(RADIANS(T$4))+T$1,\"\")","v":""},{"$f":"IF(Canoe!R32<>\"\",(Canoe!Q32*SIN(RADIANS(T$4))+Canoe!R32*COS(RADIANS(T$4))*T$3)+T$2,\"\")","v":""},{"$f":"IF(Canoe!S32<>\"\",Canoe!S32*COS(RADIANS(T$4))-Canoe!T32*SIN(RADIANS(T$4))+T$1,\"\")","v":""},{"$f":"IF(Canoe!T32<>\"\",(Canoe!S32*SIN(RADIANS(T$4))+Canoe!T32*COS(RADIANS(T$4))*T$3)+T$2,\"\")","v":""},null,{"$f":"IF(Canoe!V32<>\"\",Canoe!V32*COS(RADIANS(Y$4))-Canoe!W32*SIN(RADIANS(Y$4))+Y$1,\"\")","v":""},{"$f":"IF(Canoe!W32<>\"\",(Canoe!V32*SIN(RADIANS(Y$4))+Canoe!W32*COS(RADIANS(Y$4))*Y$3)+Y$2,\"\")","v":""},{"$f":"IF(Canoe!X32<>\"\",Canoe!X32*COS(RADIANS(Y$4))-Canoe!Y32*SIN(RADIANS(Y$4))+Y$1,\"\")","v":""},{"$f":"IF(Canoe!Y32<>\"\",(Canoe!X32*SIN(RADIANS(Y$4))+Canoe!Y32*COS(RADIANS(Y$4))*Y$3)+Y$2,\"\")","v":""}]
[3,{"$f":"IF(Canoe!B33<>\"\",Canoe!B33*COS(RADIANS(E$4))-Canoe!C33*SIN(RADIANS(E$4))+E$1,\"\")","v":600.17659375305755},{"$f":"IF(Canoe!C33<>\"\",(Canoe!B33*SIN(RADIANS(E$4))+Canoe!C33*COS(RADIANS(E$4))*E$3)+E$2,\"\")","v":2.8142841868191996E-14},{"$f":"IF(Canoe!D33<>\"\",Canoe!D33*COS(RADIANS(E$4))-Canoe!E33*SIN(RADIANS(E$4))+E$1,\"\")","v":600.17659375305755},{"$f":"IF(Canoe!E33<>\"\",(Canoe!D33*SIN(RADIANS(E$4))+Canoe!E33*COS(RADIANS(E$4))*E$3)+E$2,\"\")","v":2.8142841868191996E-14},null,{"$f":"IF(Canoe!G33<>\"\",Canoe!G33*COS(RADIANS(J$4))-Canoe!H33*SIN(RADIANS(J$4))+J$1,\"\")","v":572.68206951529351},{"$f":"IF(Canoe!H33<>\"\",(Canoe!G33*SIN(RADIANS(J$4))+Canoe!H33*COS(RADIANS(J$4))*J$3)+J$2,\"\")","v":302.77952439443914},{"$f":"IF(Canoe!I33<>\"\",Canoe!I33*COS(RADIANS(J$4))-Canoe!J33*SIN(RADIANS(J$4))+J$1,\"\")","v":572.29046072255323},{"$f":"IF(Canoe!J33<>\"\",(Canoe!I33*SIN(RADIANS(J$4))+Canoe!J33*COS(RADIANS(J$4))*J$3)+J$2,\"\")","v":607.25258829755921},null,{"$f":"IF(Canoe!L33<>\"\",Canoe!L33*COS(RADIANS(O$4))-Canoe!M33*SIN(RADIANS(O$4))+O$1,\"\")","v":599.27444452618738},{"$f":"IF(Canoe!M33<>\"\",(Canoe!L33*SIN(RADIANS(O$4))+Canoe!M33*COS(RADIANS(O$4))*O$3)+O$2,\"\")","v":52.090386710897199},{"$f":"IF(Canoe!N33<>\"\",Canoe!N33*COS(RADIANS(O$4))-Canoe!O33*SIN(RADIANS(O$4))+O$1,\"\")","v":599.30272783136593},{"$f":"IF(Canoe!O33<>\"\",(Canoe!N33*SIN(RADIANS(O$4))+Canoe!O33*COS(RADIANS(O$4))*O$3)+O$2,\"\")","v":9.0394402679995114E-2},null,{"$f":"IF(Canoe!Q33<>\"\",Canoe!Q33*COS(RADIANS(T$4))-Canoe!R33*SIN(RADIANS(T$4))+T$1,\"\")","v":572.08162866770851},{"$f":"IF(Canoe!R33<>\"\",(Canoe!Q33*SIN(RADIANS(T$4))+Canoe!R33*COS(RADIANS(T$4))*T$3)+T$2,\"\")","v":-9.547273039794657},{"$f":"IF(Canoe!S33<>\"\",Canoe!S33*COS(RADIANS(T$4))-Canoe!T33*SIN(RADIANS(T$4))+T$1,\"\")","v":572.08162866770851},{"$f":"IF(Canoe!T33<>\"\",(Canoe!S33*SIN(RADIANS(T$4))+Canoe!T33*COS(RADIANS(T$4))*T$3)+T$2,\"\")","v":-9.547273039794657},null,{"$f":"IF(Canoe!V33<>\"\",Canoe!V33*COS(RADIANS(Y$4))-Canoe!W33*SIN(RADIANS(Y$4))+Y$1,\"\")","v":""},{"$f":"IF(Canoe!W33<>\"\",(Canoe!V33*SIN(RADIANS(Y$4))+Canoe!W33*COS(RADIANS(Y$4))*Y$3)+Y$2,\"\")","v":""},{"$f":"IF(Canoe!X33<>\"\",Canoe!X33*COS(RADIANS(Y$4))-Canoe!Y33*SIN(RADIANS(Y$4))+Y$1,\"\")","v":""},{"$f":"IF(Canoe!Y33<>\"\",(Canoe!X33*SIN(RADIANS(Y$4))+Canoe!Y33*COS(RADIANS(Y$4))*Y$3)+Y$2,\"\")","v":""}]
[4,{"$f":"IF(Canoe!B34<>\"\",Canoe!B34*COS(RADIANS(E$4))-Canoe!C34*SIN(RADIANS(E$4))+E$1,\"\")","v":700.21305377496344},{"$f":"IF(Canoe!C34<>\"\",(Canoe!B34*SIN(RADIANS(E$4))+Canoe!C34*COS(RADIANS(E$4))*E$3)+E$2,\"\")","v":3.6159635485792533E-14},{"$f":"IF(Canoe!D34<>\"\",Canoe!D34*COS(RADIANS(E$4))-Canoe!E34*SIN(RADIANS(E$4))+E$1,\"\")","v":700.21305377496344},{"$f":"IF(Canoe!E34<>\"\",(Canoe!D34*SIN(RADIANS(E$4))+Canoe!E34*COS(RADIANS(E$4))*E$3)+E$2,\"\")","v":29.706790123456834},null,{"$f":"IF(Canoe!G34<>\"\",Canoe!G34*COS(RADIANS(J$4))-Canoe!H34*SIN(RADIANS(J$4))+J$1,\"\")","v":677.00512878184259},{"$f":"IF(Canoe!H34<>\"\",(Canoe!G34*SIN(RADIANS(J$4))+Canoe!H34*COS(RADIANS(J$4))*J$3)+J$2,\"\")","v":305.32629066199843},{"$f":"IF(Canoe!I34<>\"\",Canoe!I34*COS(RADIANS(J$4))-Canoe!J34*SIN(RADIANS(J$4))+J$1,\"\")","v":676.65084615385172},{"$f":"IF(Canoe!J34<>\"\",(Canoe!I34*SIN(RADIANS(J$4))+Canoe!J34*COS(RADIANS(J$4))*J$3)+J$2,\"\")","v":606.87450879920539},null,{"$f":"IF(Canoe!L34<>\"\",Canoe!L34*COS(RADIANS(O$4))-Canoe!M34*SIN(RADIANS(O$4))+O$1,\"\")","v":699.4153052123404},{"$f":"IF(Canoe!M34<>\"\",(Canoe!L34*SIN(RADIANS(O$4))+Canoe!M34*COS(RADIANS(O$4))*O$3)+O$2,\"\")","v":81.467946386825687},{"$f":"IF(Canoe!N34<>\"\",Canoe!N34*COS(RADIANS(O$4))-Canoe!O34*SIN(RADIANS(O$4))+O$1,\"\")","v":699.43243207104501},{"$f":"IF(Canoe!O34<>\"\",(Canoe!N34*SIN(RADIANS(O$4))+Canoe!O34*COS(RADIANS(O$4))*O$3)+O$2,\"\")","v":29.851258690717625},null,{"$f":"IF(Canoe!Q34<>\"\",Canoe!Q34*COS(RADIANS(T$4))-Canoe!R34*SIN(RADIANS(T$4))+T$1,\"\")","v":676.40081855834705},{"$f":"IF(Canoe!R34<>\"\",(Canoe!Q34*SIN(RADIANS(T$4))+Canoe!R34*COS(RADIANS(T$4))*T$3)+T$2,\"\")","v":-14.948507607695964},{"$f":"IF(Canoe!S34<>\"\",Canoe!S34*COS(RADIANS(T$4))-Canoe!T34*SIN(RADIANS(T$4))+T$1,\"\")","v":676.40081855834705},{"$f":"IF(Canoe!T34<>\"\",(Canoe!S34*SIN(RADIANS(T$4))+Canoe!T34*COS(RADIANS(T$4))*T$3)+T$2,\"\")","v":-9.5472730397946997},null,{"$f":"IF(Canoe!V34<>\"\",Canoe!V34*COS(RADIANS(Y$4))-Canoe!W34*SIN(RADIANS(Y$4))+Y$1,\"\")","v":""},{"$f":"IF(Canoe!W34<>\"\",(Canoe!V34*SIN(RADIANS(Y$4))+Canoe!W34*COS(RADIANS(Y$4))*Y$3)+Y$2,\"\")","v":""},{"$f":"IF(Canoe!X34<>\"\",Canoe!X34*COS(RADIANS(Y$4))-Canoe!Y34*SIN(RADIANS(Y$4))+Y$1,\"\")","v":""},{"$f":"IF(Canoe!Y34<>\"\",(Canoe!X34*SIN(RADIANS(Y$4))+Canoe!Y34*COS(RADIANS(Y$4))*Y$3)+Y$2,\"\")","v":""}]
{"$rows_left_out":54}
{"sheet":"Unfold Plot","index":4,"n_rows":0,"n_cols":0,"rows_kept":0,"cut":false,"hidden":false,"merged":[]}

{"sheet":"Offset Table","index":5,"n_rows":14,"n_cols":42,"rows_kept":14,"cut":false,"hidden":false,"merged":[]}
["Offset Tables"]
["Height WL",35,100,200,300,400,500,600,700,800,900,1000,1100,1200,1300,1400,1500,1600,1700,1800,1900,2000,2100,2200,2300,2400,2500,2600,2700,2800,2900,3000,3100,3200,3300,3400,3500,3600,3700,3800,3900,3965]
[5,260,256.06060606060606,250,250.00000000000003,250.00000000000006,249.99999999999997,250.00000000000003,249.99999999999997,250,250.00000000000003,250,250,250,249.99999999999997,250,249.99999999999997,250.00000000000003,250.00000000000003,250,250.00000000000003,250,250.00000000000003,250,250,249.99999999999997,250,249.99999999999997,250,249.99999999999997,250,250,250,250,249.99999999999997,250,250,250.00000000000003,249.99999999999997,250,256.06060606060606,260]
[4,260,256.06060606060606,250,244.59876543209879,239.50617283950621,234.72222222222223,230.24691358024691,226.08024691358023,222.22222222222223,218.67283950617283,215.43209876543207,212.5,209.87654320987653,207.56172839506175,205.55555555555557,203.85802469135805,202.46913580246914,201.38888888888886,200.61728395061729,200.15432098765433,200,200.15432098765433,200.61728395061729,201.38888888888891,202.46913580246914,203.85802469135803,205.55555555555557,207.56172839506172,209.87654320987656,212.5,215.4320987654321,218.67283950617286,222.22222222222223,226.08024691358023,230.24691358024694,234.72222222222223,239.50617283950618,244.59876543209876,250,256.06060606060606,260]
[3,260,255.94783345236152,250,244.39736520315813,239.13789813515763,234.21956786932,229.64034347896691,225.3981940374201,221.49108861800073,217.91699629403098,214.6738861388321,211.75972722572578,209.17248862803373,206.91013941907741,204.97064867217841,203.35198546065848,202.05211885783916,201.06901793704202,200.40065177158874,200.04498943480078,200,200.04498943480081,200.40065177158868,201.06901793704205,202.0521188578391,203.35198546065845,204.97064867217836,206.91013941907727,209.17248862803353,211.75972722572584,214.67388613883219,217.91699629403087,221.49108861800079,225.39819403741984,229.64034347896705,234.21956786931997,239.13789813515766,244.39736520315813,250,255.94783345236155,260]
[2,260,137.87878787878788,-50,-52.700617283950621,-55.246913580246918,-57.638888888888893,-59.876543209876544,-61.959876543209873,-63.888888888888886,-65.663580246913583,-67.283950617283963,-68.75,-70.061728395061735,-71.21913580246914,-72.222222222222229,-73.070987654320987,-73.765432098765444,-74.305555555555557,-74.691358024691354,-74.922839506172835,-75,-74.922839506172835,-74.691358024691354,-74.305555555555557,-73.765432098765444,-73.070987654320987,-72.222222222222229,-71.21913580246914,-70.061728395061721,-68.75,-67.283950617283949,-65.663580246913583,-63.888888888888886,-61.959876543209873,-59.876543209876544,-57.638888888888886,-55.246913580246911,-52.700617283950621,-50,137.87878787878788,260]
[1,260,137.87878787878788,-50,-52.700617283950621,-55.246913580246918,-57.638888888888893,-59.876543209876544,-61.959876543209873,-63.888888888888886,-65.663580246913583,-67.283950617283963,-68.75,-70.061728395061735,-71.21913580246914,-72.222222222222229,-73.070987654320987,-73.765432098765444,-74.305555555555557,-74.691358024691354,-74.922839506172835,-75,-74.922839506172835,-74.691358024691354,-74.305555555555557,-73.765432098765444,-73.070987654320987,-72.222222222222229,-71.21913580246914,-70.061728395061721,-68.75,-67.283950617283949,-65.663580246913583,-63.888888888888886,-61.959876543209873,-59.876543209876544,-57.638888888888886,-55.246913580246911,-52.700617283950621,-50,137.87878787878788,260]
[]
["Half Width",null,null,null,null,null,null,null,null,null,null,null,null,null,null,null,null,null,null,null,null,null,null,null,null,null,null,null,null,null,null,null,null,null,null,3400,3500,3600,3700,3800,3900,3965]
[5,0,0,0,29.706790123456791,57.716049382716051,84.027777777777786,108.64197530864197,131.55864197530863,152.77777777777777,172.29938271604939,190.12345679012347,206.25,220.67901234567901,233.41049382716048,244.44444444444446,253.78086419753086,261.41975308641975,267.36111111111109,271.60493827160496,274.15123456790127,275,274.15123456790121,271.60493827160491,267.36111111111109,261.41975308641975,253.78086419753089,244.44444444444446,233.41049382716051,220.67901234567901,206.25,190.12345679012344,172.29938271604937,152.77777777777777,131.55864197530863,108.64197530864197,84.027777777777786,57.716049382716051,29.706790123456788,0,0,0]
{"$rows_left_out":5}
{"sheet":"Section","index":6,"n_rows":7,"n_cols":2,"rows_kept":7,"cut":false,"hidden":false,"merged":[]}
["Section",1800]
["Y","Z"]
[0,-74.691358024691354]
[271.60493827160496,-74.691358024691354]
[321.44929699387689,200.40065177158874]
[271.60493827160496,200.61728395061729]
[271.60493827160496,250]

{"sheet":"Slice","index":7,"n_rows":115,"n_cols":2,"rows_kept":115,"cut":false,"hidden":false,"merged":[]}
["Slice",0]
["X","Y"]
[173.38670616753168,0]
[187.40260235460434,4.5994458190823968]
[216.90043494987339,13.776379228876417]
[282.50578061921323,33.573250298213708]
[200,8.6667822214518573]
[317.97446739386686,43.988268164475485]
[381.47843696811412,62.056712936125734]
[300,38.862840352779337]
{"$rows_left_out":105}