{"text_format":"1","workbook":"xlsx","n_sheets":8,"sheets":["BasicCalcs","Mini-Kayak","Offset Table","Drawing","Unfold Offset Table","Unfold Plot","Section","Slice"],"not_rendered":{"charts":0,"images":0,"macros":1,"external_links":2,"defined_names":3,"comments":0,"pivot_tables":0},"unopened":[],"bounds":{"document_bytes":16777216,"sheet_cells":100000,"rows_first":2000,"rows_last":500,"rows_between":2000,"halvings":0,"cell_chars":16384,"cell_head_chars":4096},"cells_cut":0,"cells_raw":0,"read":"whole","date_system":"1900"}

{"sheet":"BasicCalcs","index":0,"n_rows":94,"n_cols":5,"rows_kept":94,"cut":false,"hidden":false,"merged":[[66,2,66,3],[73,1,73,4],[85,1,85,4],[1,1,1,4],[13,1,13,4],[24,1,24,4],[37,1,37,4],[57,1,57,4],[59,1,59,4]]}
[]
[null,"Canoe Basic Metrics"]
[null,"Length Overall (LOA)",{"$f":"'Mini-Kayak'!M2","v":2.3896319999999998},"m"]
[null,"Beam Overall (BOA)",{"$f":"'Mini-Kayak'!M3","v":0.44800000000000001},"m"]
[null,"Length Water Line (LWL)",{"$f":"'Mini-Kayak'!M4","v":2.2388659999999998},"m"]
[null,"Beam Water Line (BWL)",{"$f":"'Mini-Kayak'!M5","v":0.28399999999999997},"m","Actually the bottom width"]
[null,"Depth Water Line (DWL)",{"$f":"'Mini-Kayak'!M6","v":7.4999999999999997E-2},"m"]
[null,"Rocker",{"$f":"'Mini-Kayak'!M7","v":7.4999999999999997E-2},"m"]
[null,"Amidships Deadrise",{"$f":"'Mini-Kayak'!M8","v":7.4808861795236776},"Degrees"]
[null,"Amidships Freeboard",{"$f":"'Mini-Kayak'!M9","v":0.153},"m"]
{"$rows_left_out":85}
{"sheet":"Mini-Kayak","index":1,"n_rows":61,"n_cols":37,"rows_kept":61,"cut":false,"hidden":false,"merged":[[19,32,19,36],[3,4,5,6],[19,17,19,21],[19,12,19,16],[19,7,19,11],[19,2,19,6],[19,27,19,31],[9,8,9,11],[10,8,10,11],[5,14,5,16],[6,14,6,16],[7,14,7,16],[8,14,8,16],[9,14,9,16],[10,14,10,16],[5,8,5,11],[6,8,6,11],[7,8,7,11],[8,8,8,11],[0,8,0,16],[19,22,19,26],[1,14,1,16],[2,14,2,16],[3,14,3,16],[4,14,4,16],[29,1,29,4],[29,6,29,9],[29,11,29,14],[29,16,29,19],[29,21,29,24],[0,0,0,2],[1,8,1,11],[2,8,2,11],[3,8,3,11],[4,8,4,11]]}
["Mini-Kayak",null,null,null,null,null,null,null,"Mini-Kayak Basic Metrics"]
["Find Offet Table at row",20,null,null,null,null,null,null,"Length Overall (LOA)",null,null,null,{"$f":"(AB22-H22)/1000","v":2.3896319999999998},"m"]
["Stations",7,null,null,null,null,null,null,"Beam Overall (BOA)",null,null,null,{"$f":"S23/500","v":0.44800000000000001},"m"]
["Chines",4,null,null,null,null,null,null,"Length Water Line (LWL)",null,null,null,{"$f":"(AB24-H24)/1000","v":2.2388659999999998},"m"]
["Forward-Aft Slice",100,"mm",null,null,null,null,null,"Beam Water Line (BWL)",null,null,null,{"$f":"N24/500","v":0.28399999999999997},"m","Actually the bottom width"]
["First slice",0,"mm",null,null,null,null,null,"Depth Water Line (DWL)",null,null,null,{"$f":"-T25/1000","v":7.4999999999999997E-2},"m"]
["Last slice",2400,"mm",null,null,null,null,null,"Rocker",null,null,null,{"$f":"(J25-T25)/1000","v":7.4999999999999997E-2},"m"]
["Water Line Slice",25,"mm",null,null,null,null,null,"Amidships Deadrise",null,null,null,{"$f":"DEGREES(ATAN2(S24-S25,T24-T25))","v":7.4808861795236776},"Degrees"]
["Draft",-75,"mm",null,null,null,null,null,"Amidships Freeboard",null,null,null,{"$f":"T22/1000","v":0.153},"m"]
["Displacement",28.235042557283208,"dm3",null,null,null,null,null,"Forward Freeboard",null,null,null,{"$f":"J22/1000","v":0.158},"m"]
{"$rows_left_out":52}
{"sheet":"Offset Table","index":2,"n_rows":12,"n_cols":34,"rows_kept":12,"cut":false,"hidden":false,"merged":[]}
["Ofset Table"]
["WL Height",0,0.01,100,118,200,300,400,500,596,600,700,800,900,1000,1100,1200,1203.1979999999999,1300,1400,1500,1600,1700,1791.2079999999999,1800,1900,2000,2100,2200,2300,2356.866,2389.6219999999994,2389.6319999999996,2400]
[4,158,158,156.07416442244067,155.81346014445441,154.91728862436676,154.38147527936269,154.31859106087512,154.58050264235087,155,155.01907669723659,155.48617989897912,155.8336789210251,155.9134404368213,155.5773311198144,154.67721764345126,153.0649666811785,153,148.68986215790818,143.5933684627289,138.03327120945437,132.20245120920706,126.29378927310933,121,120.50016621228353,115.01446283785208,110.02955996093733,105.73833839266175,102.33367894414764,100.0084624265174,99.241313818562062,99,99,0]
[3,158,158,147.97747055314312,146.29773871719743,139.10787647427776,131.32475469762471,124.56057985360802,118.74782657265179,114,113.81896948518008,109.70648322161693,106.34284241238655,103.66052168791283,101.59199567861995,100.06973901493201,99.02622632727298,99,98.402948026972311,98.122002883908564,98.113941997855548,98.309624033386015,98.639907655072733,99,99.035651527488554,99.427714315206231,99.746954682798503,99.924231294838279,99.890402815898227,99.576327910551186,99.246327078286711,99,99,0]
[2,158,157.98661016949151,24.101694915254239,0,-4.0796144631219233,-9.4127620803146161,-14.987868686992314,-20.643810425792079,-26,-26.219463439350971,-31.553703870306045,-36.485407861294355,-40.853451554952969,-44.49671109391894,-47.254062620829338,-48.964382278321189,-49,-47.708444366797423,-45.348446106827929,-42.098357359000602,-38.112172010049122,-33.543883946707211,-29,-28.547487055708583,-23.276975223786941,-17.886342337675977,-12.529582284109418,-7.3606889498209505,-2.5336562215442893,0,98.969785753524334,99,0]
[1,158,157.98661016949151,24.101694915254239,0,-11.143305474515708,-23.470146928251484,-34.427061261796709,-44.032661740327811,-52,-52.305561629021227,-59.264374193053385,-64.927712697600725,-69.314190407839675,-72.442420588946661,-74.331016506098152,-74.998591424470519,-75,-74.465860725145987,-72.749018441764903,-69.866229349858969,-65.835729936646629,-60.675756689346308,-55,-54.404546095176507,-47.040334641355628,-38.601358815102131,-29.105855103634475,-18.572059994171106,-7.0182099739304631,0,98.969785753524334,99,0]
[]
["Half Width",0,0.01,100,118,200,300,400,500,596,600,700,800,900,1000,1100,1200,1203.1979999999999,1300,1400,1500,1600,1700,1791.2079999999999,1800,1900,2000,2100,2200,2300,2356.866,2389.6219999999994,2389.6319999999996,2400]
[4,0.254,0.254,0.18299946620599833,0.17163445288203069,0.1250047320332503,7.8837085292500192E-2,4.3310022803377396E-2,1.7237041385511284E-2,0,-5.6836214146875836E-4,-1.1292690957933352E-2,-1.6122448244253115E-2,-1.624413718079866E-2,-1.2844260947940606E-2,-7.1093227260495733E-3,-2.2582569549617443E-4,0,0,0,0,0,0,0,0,0,0,0,0,0,0,0,0,0]
[3,0.254,0.254,36.684868670025239,42.891953775684783,69.818471274519169,99.671072906757644,126.26274783409937,149.61357032390299,169,169.74361464352722,186.67295506033085,200.42166584167248,211.00982125491083,218.45749556740461,222.7847630465125,224.01169795959322,224,222.36656128816279,217.62983448602324,209.77717486654038,198.79134183502106,184.65509479677212,169,167.35119315710037,146.86239632131259,123.17146369471554,96.261154682616151,66.114228690321156,32.713445123137411,12.261895438296214,0,0,0]
{"$rows_left_out":3}
{"sheet":"Drawing","index":3,"n_rows":43,"n_cols":37,"rows_kept":43,"cut":false,"hidden":false,"merged":[]}
["  "]
[]
[]
[]
[]
[]
[]
[]
[]
[]
{"$rows_left_out":34}
{"sheet":"Unfold Offset Table","index":4,"n_rows":61,"n_cols":25,"rows_kept":61,"cut":false,"hidden":false,"merged":[[4,1,4,4],[4,6,4,9],[4,11,4,14],[4,16,4,19],[4,21,4,24]]}
[null,null,null,"Xofs",-83,null,null,null,"Xofs",-33,null,null,null,"Xofs",4,null,null,null,"Xofs",3,null,null,null,"Xofs",0]
["Offset",400,1000,"Yofs",184,null,null,null,"Yofs",343,null,null,null,"Yofs",346,null,null,null,"Yofs",{"$f":"O2+53","v":399},null,null,null,"Yofs",0]
["Number of Lines",{"$f":"COUNT(A7:A61)","v":55},null,"Mirror",-1,null,null,null,"Mirror",1,null,null,null,"Mirror",-1,null,null,null,"Mirror",-1,null,null,null,"Mirror",1]
["Number of Planks",{"$f":"'Mini-Kayak'!B4","v":4},null,"Rotation",0,null,null,null,"Rotation",1.9,null,null,null,"Rotation",-0.2,null,null,null,"Rotation",0,null,null,null,"Rotation",0]
[null,{"$f":"'Mini-Kayak'!B30","v":"Centreline - Chine"},null,null,null,null,{"$f":"'Mini-Kayak'!G30","v":"Chine - Sheer"},null,null,null,null,{"$f":"'Mini-Kayak'!L30","v":"Sheer - Deck"},null,null,null,null,{"$f":"'Mini-Kayak'!L30&\" Overlap\"","v":"Sheer - Deck Overlap"},null,null,null,null,{"$f":"'Mini-Kayak'!V30","v":0}]
[null,"X Lower","Y Lower","X Upper","Y Upper",null,"X Lower","Y Lower","X Upper","Y Upper",null,"X Lower","Y Lower","X Upper","Y Upper",null,"X Lower","Y Lower","X Upper","Y Upper",null,"X Lower","Y Lower","X Upper","Y Upper"]
[1,{"$f":"IF('Mini-Kayak'!B32<>\"\",'Mini-Kayak'!B32*COS(RADIANS(E$4))-'Mini-Kayak'!C32*SIN(RADIANS(E$4))+E$1,\"\")","v":""},{"$f":"IF('Mini-Kayak'!C32<>\"\",('Mini-Kayak'!B32*SIN(RADIANS(E$4))+'Mini-Kayak'!C32*COS(RADIANS(E$4))*E$3)+E$2,\"\")","v":""},{"$f":"IF('Mini-Kayak'!D32<>\"\",'Mini-Kayak'!D32*COS(RADIANS(E$4))-'Mini-Kayak'!E32*SIN(RADIANS(E$4))+E$1,\"\")","v":""},{"$f":"IF('Mini-Kayak'!E32<>\"\",('Mini-Kayak'!D32*SIN(RADIANS(E$4))+'Mini-Kayak'!E32*COS(RADIANS(E$4))*E$3)+E$2,\"\")","v":""},null,{"$f":"IF('Mini-Kayak'!G32<>\"\",'Mini-Kayak'!G32*COS(RADIANS(J$4))-'Mini-Kayak'!H32*SIN(RADIANS(J$4))+J$1,\"\")","v":-32.989383499862441},{"$f":"IF('Mini-Kayak'!H32<>\"\",('Mini-Kayak'!G32*SIN(RADIANS(J$4))+'Mini-Kayak'!H32*COS(RADIANS(J$4))*J$3)+J$2,\"\")","v":342.98709350993198},{"$f":"IF('Mini-Kayak'!I32<>\"\",'Mini-Kayak'!I32*COS(RADIANS(J$4))-'Mini-Kayak'!J32*SIN(RADIANS(J$4))+J$1,\"\")","v":-32.990010986712022},{"$f":"IF('Mini-Kayak'!J32<>\"\",('Mini-Kayak'!I32*SIN(RADIANS(J$4))+'Mini-Kayak'!J32*COS(RADIANS(J$4))*J$3)+J$2,\"\")","v":343.00046862941929},{"$f":"O7-J7","v":3.0031652197345124},{"$f":"IF('Mini-Kayak'!L32<>\"\",'Mini-Kayak'!L32*COS(RADIANS(O$4))-'Mini-Kayak'!M32*SIN(RADIANS(O$4))+O$1,\"\")","v":4.0092907950689947},{"$f":"IF('Mini-Kayak'!M32<>\"\",('Mini-Kayak'!L32*SIN(RADIANS(O$4))+'Mini-Kayak'!M32*COS(RADIANS(O$4))*O$3)+O$2,\"\")","v":346.0036338491538},{"$f":"IF('Mini-Kayak'!N32<>\"\",'Mini-Kayak'!N32*COS(RADIANS(O$4))-'Mini-Kayak'!O32*SIN(RADIANS(O$4))+O$1,\"\")","v":4.0092907950689947},{"$f":"IF('Mini-Kayak'!O32<>\"\",('Mini-Kayak'!N32*SIN(RADIANS(O$4))+'Mini-Kayak'!O32*COS(RADIANS(O$4))*O$3)+O$2,\"\")","v":346.0036338491538},null,{"$f":"IF('Mini-Kayak'!L32<>\"\",'Mini-Kayak'!L32*COS(RADIANS(T$4))-'Mini-Kayak'!M32*SIN(RADIANS(T$4))+T$1,\"\")","v":3.0093036496903629},{"$f":"IF('Mini-Kayak'!M32<>\"\",('Mini-Kayak'!L32*SIN(RADIANS(T$4))+'Mini-Kayak'!M32*COS(RADIANS(T$4))*T$3)+T$2,\"\")","v":399.0036663472884},{"$f":"IF('Mini-Kayak'!N32<>\"\",'Mini-Kayak'!N32*COS(RADIANS(T$4))-'Mini-Kayak'!O32*SIN(RADIANS(T$4))+T$1,\"\")","v":3.0093036496903629},{"$f":"IF('Mini-Kayak'!O32<>\"\",MAX(('Mini-Kayak'!N32*SIN(RADIANS(T$4))+'Mini-Kayak'!O32*COS(RADIANS(T$4))*T$3)+T$2,M7+3),\"\")","v":399.0036663472884},null,{"$f":"IF('Mini-Kayak'!V32<>\"\",'Mini-Kayak'!V32*COS(RADIANS(Y$4))-'Mini-Kayak'!W32*SIN(RADIANS(Y$4))+Y$1,\"\")","v":""},{"$f":"IF('Mini-Kayak'!W32<>\"\",('Mini-Kayak'!V32*SIN(RADIANS(Y$4))+'Mini-Kayak'!W32*COS(RADIANS(Y$4))*Y$3)+Y$2,\"\")","v":""},{"$f":"IF('Mini-Kayak'!X32<>\"\",'Mini-Kayak'!X32*COS(RADIANS(Y$4))-'Mini-Kayak'!Y32*SIN(RADIANS(Y$4))+Y$1,\"\")","v":""},{"$f":"IF('Mini-Kayak'!Y32<>\"\",('Mini-Kayak'!X32*SIN(RADIANS(Y$4))+'Mini-Kayak'!Y32*COS(RADIANS(Y$4))*Y$3)+Y$2,\"\")","v":""}]
[2,{"$f":"IF('Mini-Kayak'!B33<>\"\",'Mini-Kayak'!B33*COS(RADIANS(E$4))-'Mini-Kayak'!C33*SIN(RADIANS(E$4))+E$1,\"\")","v":""},{"$f":"IF('Mini-Kayak'!C33<>\"\",('Mini-Kayak'!B33*SIN(RADIANS(E$4))+'Mini-Kayak'!C33*COS(RADIANS(E$4))*E$3)+E$2,\"\")","v":""},{"$f":"IF('Mini-Kayak'!D33<>\"\",'Mini-Kayak'!D33*COS(RADIANS(E$4))-'Mini-Kayak'!E33*SIN(RADIANS(E$4))+E$1,\"\")","v":""},{"$f":"IF('Mini-Kayak'!E33<>\"\",('Mini-Kayak'!D33*SIN(RADIANS(E$4))+'Mini-Kayak'!E33*COS(RADIANS(E$4))*E$3)+E$2,\"\")","v":""},null,{"$f":"IF('Mini-Kayak'!G33<>\"\",'Mini-Kayak'!G33*COS(RADIANS(J$4))-'Mini-Kayak'!H33*SIN(RADIANS(J$4))+J$1,\"\")","v":73.165001375246533},{"$f":"IF('Mini-Kayak'!H33<>\"\",('Mini-Kayak'!G33*SIN(RADIANS(J$4))+'Mini-Kayak'!H33*COS(RADIANS(J$4))*J$3)+J$2,\"\")","v":213.93509931990977},{"$f":"IF('Mini-Kayak'!I33<>\"\",'Mini-Kayak'!I33*COS(RADIANS(J$4))-'Mini-Kayak'!J33*SIN(RADIANS(J$4))+J$1,\"\")","v":73.900851326998676},{"$f":"IF('Mini-Kayak'!J33<>\"\",('Mini-Kayak'!I33*SIN(RADIANS(J$4))+'Mini-Kayak'!J33*COS(RADIANS(J$4))*J$3)+J$2,\"\")","v":343.05471249618023},4.4046735624428379,{"$f":"IF('Mini-Kayak'!L33<>\"\",'Mini-Kayak'!L33*COS(RADIANS(O$4))-'Mini-Kayak'!M33*SIN(RADIANS(O$4))+O$1,\"\")","v":103.31941323298405},{"$f":"IF('Mini-Kayak'!M33<>\"\",('Mini-Kayak'!L33*SIN(RADIANS(O$4))+'Mini-Kayak'!M33*COS(RADIANS(O$4))*O$3)+O$2,\"\")","v":384.84616580716403},{"$f":"IF('Mini-Kayak'!N33<>\"\",'Mini-Kayak'!N33*COS(RADIANS(O$4))-'Mini-Kayak'!O33*SIN(RADIANS(O$4))+O$1,\"\")","v":103.99466475561546},{"$f":"IF('Mini-Kayak'!O33<>\"\",('Mini-Kayak'!N33*SIN(RADIANS(O$4))+'Mini-Kayak'!O33*COS(RADIANS(O$4))*O$3)+O$2,\"\")","v":347.45938605862307},null,{"$f":"IF('Mini-Kayak'!L33<>\"\",'Mini-Kayak'!L33*COS(RADIANS(T$4))-'Mini-Kayak'!M33*SIN(RADIANS(T$4))+T$1,\"\")","v":102.4568302615785},{"$f":"IF('Mini-Kayak'!M33<>\"\",('Mini-Kayak'!L33*SIN(RADIANS(T$4))+'Mini-Kayak'!M33*COS(RADIANS(T$4))*T$3)+T$2,\"\")","v":438.19357371313373},{"$f":"IF('Mini-Kayak'!N33<>\"\",'Mini-Kayak'!N33*COS(RADIANS(T$4))-'Mini-Kayak'!O33*SIN(RADIANS(T$4))+T$1,\"\")","v":103.00158673003753},{"$f":"IF('Mini-Kayak'!O33<>\"\",MAX(('Mini-Kayak'!N33*SIN(RADIANS(T$4))+'Mini-Kayak'!O33*COS(RADIANS(T$4))*T$3)+T$2,M8+3),\"\")","v":400.80846775667135},null,{"$f":"IF('Mini-Kayak'!V33<>\"\",'Mini-Kayak'!V33*COS(RADIANS(Y$4))-'Mini-Kayak'!W33*SIN(RADIANS(Y$4))+Y$1,\"\")","v":""},{"$f":"IF('Mini-Kayak'!W33<>\"\",('Mini-Kayak'!V33*SIN(RADIANS(Y$4))+'Mini-Kayak'!W33*COS(RADIANS(Y$4))*Y$3)+Y$2,\"\")","v":""},{"$f":"IF('Mini-Kayak'!X33<>\"\",'Mini-Kayak'!X33*COS(RADIANS(Y$4))-'Mini-Kayak'!Y33*SIN(RADIANS(Y$4))+Y$1,\"\")","v":""},{"$f":"IF('Mini-Kayak'!Y33<>\"\",('Mini-Kayak'!X33*SIN(RADIANS(Y$4))+'Mini-Kayak'!Y33*COS(RADIANS(Y$4))*Y$3)+Y$2,\"\")","v":""}]
[3,{"$f":"IF('Mini-Kayak'!B34<>\"\",'Mini-Kayak'!B34*COS(RADIANS(E$4))-'Mini-Kayak'!C34*SIN(RADIANS(E$4))+E$1,\"\")","v":114.14712009556959},{"$f":"IF('Mini-Kayak'!C34<>\"\",('Mini-Kayak'!B34*SIN(RADIANS(E$4))+'Mini-Kayak'!C34*COS(RADIANS(E$4))*E$3)+E$2,\"\")","v":188.58399803916328},{"$f":"IF('Mini-Kayak'!D34<>\"\",'Mini-Kayak'!D34*COS(RADIANS(E$4))-'Mini-Kayak'!E34*SIN(RADIANS(E$4))+E$1,\"\")","v":114.14712009556959},{"$f":"IF('Mini-Kayak'!E34<>\"\",('Mini-Kayak'!D34*SIN(RADIANS(E$4))+'Mini-Kayak'!E34*COS(RADIANS(E$4))*E$3)+E$2,\"\")","v":188.58399803916328},{"$f":"C9-H9","v":-2.1193252090508281},{"$f":"IF('Mini-Kayak'!G34<>\"\",'Mini-Kayak'!G34*COS(RADIANS(J$4))-'Mini-Kayak'!H34*SIN(RADIANS(J$4))+J$1,\"\")","v":92.274587407983674},{"$f":"IF('Mini-Kayak'!H34<>\"\",('Mini-Kayak'!G34*SIN(RADIANS(J$4))+'Mini-Kayak'!H34*COS(RADIANS(J$4))*J$3)+J$2,\"\")","v":190.7033232482141},{"$f":"IF('Mini-Kayak'!I34<>\"\",'Mini-Kayak'!I34*COS(RADIANS(J$4))-'Mini-Kayak'!J34*SIN(RADIANS(J$4))+J$1,\"\")","v":93.014941068221958},{"$f":"IF('Mini-Kayak'!J34<>\"\",('Mini-Kayak'!I34*SIN(RADIANS(J$4))+'Mini-Kayak'!J34*COS(RADIANS(J$4))*J$3)+J$2,\"\")","v":343.085984113552},4.6181953679934509,{"$f":"IF('Mini-Kayak'!L34<>\"\",'Mini-Kayak'!L34*COS(RADIANS(O$4))-'Mini-Kayak'!M34*SIN(RADIANS(O$4))+O$1,\"\")","v":121.20289590949598},{"$f":"IF('Mini-Kayak'!M34<>\"\",('Mini-Kayak'!L34*SIN(RADIANS(O$4))+'Mini-Kayak'!M34*COS(RADIANS(O$4))*O$3)+O$2,\"\")","v":391.46877777438772},{"$f":"IF('Mini-Kayak'!N34<>\"\",'Mini-Kayak'!N34*COS(RADIANS(O$4))-'Mini-Kayak'!O34*SIN(RADIANS(O$4))+O$1,\"\")","v":121.99274413652753},{"$f":"IF('Mini-Kayak'!O34<>\"\",('Mini-Kayak'!N34*SIN(RADIANS(O$4))+'Mini-Kayak'!O34*COS(RADIANS(O$4))*O$3)+O$2,\"\")","v":347.70417948154545},null,{"$f":"IF('Mini-Kayak'!L34<>\"\",'Mini-Kayak'!L34*COS(RADIANS(T$4))-'Mini-Kayak'!M34*SIN(RADIANS(T$4))+T$1,\"\")","v":120.3637575948176},{"$f":"IF('Mini-Kayak'!M34<>\"\",('Mini-Kayak'!L34*SIN(RADIANS(T$4))+'Mini-Kayak'!M34*COS(RADIANS(T$4))*T$3)+T$2,\"\")","v":444.87873324987515},{"$f":"IF('Mini-Kayak'!N34<>\"\",'Mini-Kayak'!N34*COS(RADIANS(T$4))-'Mini-Kayak'!O34*SIN(RADIANS(T$4))+T$1,\"\")","v":121.00084957833809},{"$f":"IF('Mini-Kayak'!O34<>\"\",MAX(('Mini-Kayak'!N34*SIN(RADIANS(T$4))+'Mini-Kayak'!O34*COS(RADIANS(T$4))*T$3)+T$2,M9+3),\"\")","v":401.11609220608153},null,{"$f":"IF('Mini-Kayak'!V34<>\"\",'Mini-Kayak'!V34*COS(RADIANS(Y$4))-'Mini-Kayak'!W34*SIN(RADIANS(Y$4))+Y$1,\"\")","v":""},{"$f":"IF('Mini-Kayak'!W34<>\"\",('Mini-Kayak'!V34*SIN(RADIANS(Y$4))+'Mini-Kayak'!W34*COS(RADIANS(Y$4))*Y$3)+Y$2,\"\")","v":""},{"$f":"IF('Mini-Kayak'!X34<>\"\",'Mini-Kayak'!X34*COS(RADIANS(Y$4))-'Mini-Kayak'!Y34*SIN(RADIANS(Y$4))+Y$1,\"\")","v":""},{"$f":"IF('Mini-Kayak'!Y34<>\"\",('Mini-Kayak'!X34*SIN(RADIANS(Y$4))+'Mini-Kayak'!Y34*COS(RADIANS(Y$4))*Y$3)+Y$2,\"\")","v":""}]
[4,{"$f":"IF('Mini-Kayak'!B35<>\"\",'Mini-Kayak'!B35*COS(RADIANS(E$4))-'Mini-Kayak'!C35*SIN(RADIANS(E$4))+E$1,\"\")","v":196.87845383676404},{"$f":"IF('Mini-Kayak'!C35<>\"\",('Mini-Kayak'!B35*SIN(RADIANS(E$4))+'Mini-Kayak'!C35*COS(RADIANS(E$4))*E$3)+E$2,\"\")","v":190.50763898032008},{"$f":"IF('Mini-Kayak'!D35<>\"\",'Mini-Kayak'!D35*COS(RADIANS(E$4))-'Mini-Kayak'!E35*SIN(RADIANS(E$4))+E$1,\"\")","v":196.67668553886784},{"$f":"IF('Mini-Kayak'!E35<>\"\",('Mini-Kayak'!D35*SIN(RADIANS(E$4))+'Mini-Kayak'!E35*COS(RADIANS(E$4))*E$3)+E$2,\"\")","v":158.69921177327623},{"$f":"C10-H10","v":-4.5387745812653577},{"$f":"IF('Mini-Kayak'!G35<>\"\",'Mini-Kayak'!G35*COS(RADIANS(J$4))-'Mini-Kayak'!H35*SIN(RADIANS(J$4))+J$1,\"\")","v":179.94081345283692},{"$f":"IF('Mini-Kayak'!H35<>\"\",('Mini-Kayak'!G35*SIN(RADIANS(J$4))+'Mini-Kayak'!H35*COS(RADIANS(J$4))*J$3)+J$2,\"\")","v":195.04641356158544},{"$f":"IF('Mini-Kayak'!I35<>\"\",'Mini-Kayak'!I35*COS(RADIANS(J$4))-'Mini-Kayak'!J35*SIN(RADIANS(J$4))+J$1,\"\")","v":179.62137443743978},{"$f":"IF('Mini-Kayak'!J35<>\"\",('Mini-Kayak'!I35*SIN(RADIANS(J$4))+'Mini-Kayak'!J35*COS(RADIANS(J$4))*J$3)+J$2,\"\")","v":343.32507144159791},5.4353469568591777,{"$f":"IF('Mini-Kayak'!L35<>\"\",'Mini-Kayak'!L35*COS(RADIANS(O$4))-'Mini-Kayak'!M35*SIN(RADIANS(O$4))+O$1,\"\")","v":202.69527934084149},{"$f":"IF('Mini-Kayak'!M35<>\"\",('Mini-Kayak'!L35*SIN(RADIANS(O$4))+'Mini-Kayak'!M35*COS(RADIANS(O$4))*O$3)+O$2,\"\")","v":420.2201755098543},{"$f":"IF('Mini-Kayak'!N35<>\"\",'Mini-Kayak'!N35*COS(RADIANS(O$4))-'Mini-Kayak'!O35*SIN(RADIANS(O$4))+O$1,\"\")","v":203.9814796649236},{"$f":"IF('Mini-Kayak'!O35<>\"\",('Mini-Kayak'!N35*SIN(RADIANS(O$4))+'Mini-Kayak'!O35*COS(RADIANS(O$4))*O$3)+O$2,\"\")","v":348.76041839845709},null,{"$f":"IF('Mini-Kayak'!L35<>\"\",'Mini-Kayak'!L35*COS(RADIANS(T$4))-'Mini-Kayak'!M35*SIN(RADIANS(T$4))+T$1,\"\")","v":201.95799404785694},{"$f":"IF('Mini-Kayak'!M35<>\"\",('Mini-Kayak'!L35*SIN(RADIANS(T$4))+'Mini-Kayak'!M35*COS(RADIANS(T$4))*T$3)+T$2,\"\")","v":473.91512492192521},{"$f":"IF('Mini-Kayak'!N35<>\"\",'Mini-Kayak'!N35*COS(RADIANS(T$4))-'Mini-Kayak'!O35*SIN(RADIANS(T$4))+T$1,\"\")","v":202.99477069918973},{"$f":"IF('Mini-Kayak'!O35<>\"\",MAX(('Mini-Kayak'!N35*SIN(RADIANS(T$4))+'Mini-Kayak'!O35*COS(RADIANS(T$4))*T$3)+T$2,M10+3),\"\")","v":423.2201755098543},null,{"$f":"IF('Mini-Kayak'!V35<>\"\",'Mini-Kayak'!V35*COS(RADIANS(Y$4))-'Mini-Kayak'!W35*SIN(RADIANS(Y$4))+Y$1,\"\")","v":""},{"$f":"IF('Mini-Kayak'!W35<>\"\",('Mini-Kayak'!V35*SIN(RADIANS(Y$4))+'Mini-Kayak'!W35*COS(RADIANS(Y$4))*Y$3)+Y$2,\"\")","v":""},{"$f":"IF('Mini-Kayak'!X35<>\"\",'Mini-Kayak'!X35*COS(RADIANS(Y$4))-'Mini-Kayak'!Y35*SIN(RADIANS(Y$4))+Y$1,\"\")","v":""},{"$f":"IF('Mini-Kayak'!Y35<>\"\",('Mini-Kayak'!X35*SIN(RADIANS(Y$4))+'Mini-Kayak'!Y35*COS(RADIANS(Y$4))*Y$3)+Y$2,\"\")","v":""}]
{"$rows_left_out":52}
{"sheet":"Unfold Plot","index":5,"n_rows":0,"n_cols":0,"rows_kept":0,"cut":false,"hidden":false,"merged":[]}

{"sheet":"Section","index":6,"n_rows":6,"n_cols":2,"rows_kept":6,"cut":false,"hidden":false,"merged":[]}
["Section",1203]
["Y","Z"]
[0,-75]
[198,-49]
[224,99]
[0,153]

{"sheet":"Slice","index":7,"n_rows":88,"n_cols":2,"rows_kept":88,"cut":false,"hidden":false,"merged":[]}
["Slice",0]
["X","Y"]
[117.99925322652551,0.254]
[117.99925328848377,0.254]
[117.99925322652551,0.254]
[117.99925319554252,0.254]
[117.99988692789195,0.25424834662319956]
[118.00735735778508,0.25400240782679229]
[118.01077039878528,0.25604036822150406]
[118,0.254]
{"$rows_left_out":78}